CSC : error CS1577: Assembly generation failed -

Collapse
X
 
  • Time
  • Show
Clear All
new posts
  • tvnaidu
    Contributor
    • Oct 2009
    • 365

    #1

    CSC : error CS1577: Assembly generation failed -

    I am getting below error, I spent lot of time on net to look for an answer why my build failed due to this error, any idea? thanks in advance

    CSC : error CS1577: Assembly generation failed -- Referenced assembly 'sample_DotNET' does not have a strong name

    1>Build FAILED.
  • weaknessforcats
    Recognized Expert Expert
    • Mar 2007
    • 9214

    #2
    What language are you using?

    Comment

    • tvnaidu
      Contributor
      • Oct 2009
      • 365

      #3
      Sorry, this is C# Dotnet

      Comment

      Working...